☰
AMBA总线协议V2.0工程精解:AHB/ASB/APB分层时序与验证落地
2026/10/26 6:03:36 网站建设 项目流程

简介:本资源为ARM官方AMBA总线协议V2.0中文版完整规范文档,面向嵌入式系统工程师、SoC设计人员及高校微电子/计算机体系结构方向学习者,解决AMBA总线架构理解门槛高、英文原版阅读困难、协议细节查阅不便等实际问题。文档全面涵盖AHB(高性能总线)、ASB(系统总线)与APB(外设总线)三大核心模块,包含信号定义、时序图惯例、测试方法及典型微控制器总线拓扑示例,并附有详尽的版权声明与使用约束说明,便于工程实践与教学参考。资源为单文件PDF格式,大小1.2MB,内容结构清晰,共分七章,从总线概述、信号描述到各子总线详解及测试规范,具备完整技术文档属性。目前已有1230人学习下载,是深入理解ARM片上互连架构、开展IP集成与验证工作的权威中文参考资料。

1. AMBA总线协议中文版:不是“翻译文档”,而是芯片级互连的底层契约

你手头那块刚流片回来的SoC,CPU核跑得飞起,DMA却总在突发传输时卡顿半拍;仿真波形里HREADY拉低三拍才响应,但RTL代码里明明写了“单周期完成”;APB外设寄存器读写顺序对不上,调试器连上就报地址解码错误——这些玄学问题,90%以上根子不在你的模块逻辑里,而在AMBA总线协议的信号时序边界、响应语义定义、仲裁移交规则这三处黑匣子中。这份AMBA总线规范V2.0中文版,不是ARM官网英文PDF的简单字面翻译,而是把AHB/ASB/APB三大总线的电气约束、状态机跳转条件、信号采样窗口、错误传播路径全部掰开揉碎后重写的工程实操手册。它专为正在做SoC集成、IP核验证、FPGA原型系统搭建的硬件工程师准备——当你需要确认HRESP=2'b10(ERROR)是否允许在BURST中途插入,或者APB_PREADY必须在PSEL高电平后的第几个时钟沿有效时,这份文档就是你查证的唯一权威依据。它不教你怎么写Verilog,但能让你一眼看穿总线互联层所有“不该发生却发生了”的翻车现场。


2. AMBA总线架构拆解:为什么必须同时掌握AHB/ASB/APB三层协议

AMBA不是单一总线,而是一套分层互连体系。它的设计哲学是“按性能分级、按功能隔离、按带宽分治”。理解这一点,才能避免把APB从机当成AHB从机去挂载,或误用ASB的锁存机制去驱动高速内存控制器。下面从协议定位、信号特征、典型应用场景三个维度,把V2.0规范里的核心分层逻辑讲透。

2.1 AHB:高性能主干网,专治CPU与内存之间的带宽饥渴

AHB(Advanced High-performance Bus)是AMBA家族里的“高速公路”。它面向的是高吞吐、低延迟、多主机竞争场景,典型应用包括:CPU核与L1 Cache直连、DMA引擎与DDR控制器通信、GPU纹理单元访问显存。V2.0规范明确要求AHB必须支持流水线式地址/数据分离传输、突发(BURST)操作、主从双向握手、多主机仲裁四大能力。关键信号如HADDR(32位地址)、HWDATA/HRDATA(32位数据)、HTRANS(传输类型)、HSIZE(传输大小)、HRESP(响应状态)共同构成一个强时序约束系统。特别注意:AHB的地址相位和数据相位是解耦的,HADDR在HCLK上升沿采样,而HRDATA必须在HREADY为高后的下一个HCLK上升沿才被主设备采样——这个“地址先行、数据滞后”的特性,是很多初学者仿真失败的根源。

2.2 ASB:系统级中转站,平衡性能与兼容性的过渡方案

ASB(Advanced System Bus)在V2.0中定位为“AHB与APB之间的缓冲层”,但它并非可有可无。当系统中存在非ARM架构的协处理器(如DSP核)、遗留的8/16位外设、或需要独立时钟域隔离的子系统时,ASB的价值就凸显出来。它支持非连续传输(Non-sequential)、仅地址传输(Address-only)、多主机锁定(Locked Transfer)等灵活模式。例如,某DSP核需要独占访问一块共享SRAM,在ASB上发起LOCKED传输后,仲裁器会强制其他主机等待该事务完成,避免了AHB上因突发中断导致的数据错乱。V2.0文档第4章明确指出:ASB的地址总线宽度可配置(8/16/32位),而控制信号如ASB_ADR、ASB_DAT、ASB_RW的时序关系比AHB更宽松——这意味着你在做跨时钟域桥接时,ASB的同步电路设计复杂度显著低于AHB。

2.3 APB:外设控制神经末梢,用极简换可靠

APB(Advanced Peripheral Bus)是AMBA里最“佛系”的一层,专为低速、低功耗、寄存器级访问的外设服务:UART、I2C、GPIO、看门狗、ADC配置寄存器等。它的设计信条是“够用就好”:没有突发传输、没有多主机、没有复杂仲裁,只有最朴素的两相握手(PSEL/PENABLE + PREADY)。V2.0规范第5章强调:APB是同步、非流水线、单次传输总线,所有信号均在PCLK上升沿采样。关键约束在于PREADY必须在PSEL为高后的至少一个完整PCLK周期内返回有效响应,否则主设备将进入等待状态。这种“慢但确定”的特性,让APB成为SoC中调试最友好的总线——你用逻辑分析仪抓几拍波形,就能100%还原寄存器读写过程。但正因如此,把APB当成AHB去挂接高速SPI Flash控制器,必然导致性能瓶颈和时序违例。

提示:V2.0规范中AHB/ASB/APB的信号命名严格区分前缀(Hxxx / Axxx / Pxxx),这是集成时避免信号混淆的第一道防线。切勿在顶层连接时混用HADDR与PADDR,哪怕它们物理上都连到同一组FPGA引脚。


3. 信号时序精读:从V2.0规范原文抠出3个致命细节

AMBA总线的“正确性”不取决于你写了多少行RTL代码,而取决于你是否精准满足了V2.0规范中那些藏在时序图角落里的微秒级约束。下面直接从文档第2章“AMBA信号”和第3章“AMBA AHB”中提取三个高频踩坑点,逐条对照原文条款给出可验证的实现要点。

3.1 HREADY信号的“双刃剑”属性:既是流控开关,也是死锁导火索

V2.0规范第3.9.1节明确定义:“HREADY为低时,当前传输未完成,主设备必须保持HADDR、HWDATA、HWRITE等信号不变,直到HREADY变高”。但新手常忽略其反向约束:HREADY必须由从机在HCLK上升沿后、下一个HCLK上升沿前的窗口内稳定输出。文档第3.18.3节“时序参数”表明确给出:tHREADY(HREADY建立时间)≥ 2ns,tHREADYH(HREADY保持时间)≥ 1ns(以典型工艺为例)。这意味着:

  • 若你的APB-to-AHB桥接模块在响应AHB读请求时,因内部组合逻辑过长导致PREADY延迟,进而使HREADY拉低超过2个HCLK周期,AHB主设备将陷入无限等待;
  • 更隐蔽的坑是:某些综合工具会自动插入缓冲器优化时序,导致HREADY路径延时突变,仿真通过但上板失败。

实操验证法:在仿真中强制将HREADY置低3个周期,观察主设备HADDR是否真的锁存不变(应不变);再将HREADY置低5个周期,检查HRESP是否在第4周期后强制变为ERROR(V2.0第3.9.4节要求超时错误上报)。

3.2 HRESP响应状态的“语义鸿沟”:ERROR≠立即终止,SPLIT需主动重试

V2.0规范第3.9.4节规定HRESP=2'b10表示“传输错误”,但没说清错误发生后总线状态机如何迁移。关键细节在第3.11.4节:“突发提前终止(Early Burst Termination)发生时,仲裁器必须撤销当前主机的HBUSREQ,并在下一周期授予新主机”。这意味着:

  • 当从机返回HRESP=2'b10,主机不能简单丢弃后续BURST拍数,而必须等待HBUSREQ被撤销后,再重新发起单次传输;
  • 更易被忽视的是SPLIT响应(HRESP=2'b01):它表示“从机暂时无法服务,请稍后重试”,但V2.0第3.9.5节强调“重试必须由主机主动发起,仲裁器不负责调度”。若你的DMA控制器收到SPLIT后静默等待,整个总线将僵死。

代码级落地:在AHB主机RTL中,必须为HRESP=2'b10和2'b01分别设置独立的状态分支。例如:

always @(posedge HCLK) begin if (HRESETn == 1'b0) state <= IDLE; else case (state) IDLE: if (HTRANS == 3'b010) state <= ADDR_PHASE; // NONSEQ ADDR_PHASE: if (HREADY && (HRESP == 2'b10)) state <= ERROR_HANDLING; else if (HREADY && (HRESP == 2'b01)) state <= SPLIT_WAIT; ERROR_HANDLING: if (HBUSREQ == 1'b0) state <= RETRY_SINGLE; // 等待仲裁释放后重试 SPLIT_WAIT: if (retry_timer == MAX_RETRY) state <= ABORT; // 超时则放弃 endcase end

这段代码的核心逻辑来自V2.0第3.11.4节“突发提前终止”和第3.9.5节“分块和重试”的交叉约束。

3.3 APB的PSEL/PENABLE时序:那个被忽略的“半个周期”偏移

APB看似简单,但V2.0规范第5.3.2节埋了一个经典陷阱:“PSEL在PCLK上升沿采样,PENABLE在PSEL为高后的下一个PCLK上升沿才有效”。这意味着:

  • 主设备在PCLK上升沿置PSEL=1,此时PENABLE仍为0(空闲态);
  • 下一个PCLK上升沿,主设备将PENABLE置1,从机才开始采样PADDR并准备响应;
  • 若你误将PSEL与PENABLE在同一沿置高,从机可能在PENABLE=0时就误判为有效传输,导致地址锁存错误。

波形验证法:用逻辑分析仪捕获PCLK、PSEL、PENABLE三信号,测量PSEL上升沿到PENABLE上升沿的时间差。V2.0第5.3.3节要求该延迟必须≥ 1个PCLK周期,且≤ 1.5个PCLK周期(典型值1.2ns)。若实测为0,说明RTL中存在时序违规。


4. 避坑指南:AMBA总线集成中5个血泪经验总结

在多个SoC项目中,我见过太多因误解V2.0规范细节导致的流片返工。下面这5条,每一条都对应一次真实的tape-out失败或FPGA调试崩溃,按“现象→原因→解决”结构列出,全是硬核教训。

4.1 现象:AHB突发传输最后一拍数据错乱,但前几拍完全正确

原因:V2.0规范第3.6.1节规定“突发提前终止时,HTRANS必须在HREADY为高后立即置为IDLE”,但RTL中未在HREADY上升沿同步更新HTRANS,导致最后一拍HTRANS仍为BUSY,从机误判为继续传输。
解决:在AHB主机状态机中,将HTRANS更新严格绑定到HREADY上升沿触发的时序逻辑,禁用任何组合逻辑直接赋值。

4.2 现象:APB外设寄存器写入后读取值始终为0,逻辑分析仪显示PWRITE为高

原因:V2.0规范第5.4.1节明确“PWRITE为高表示写操作”,但文档第5.2.3节补充说明“PWRITE必须在PENABLE为高期间保持稳定”。实际RTL中PWRITE在PENABLE=0时已翻转,导致从机在PENABLE=1瞬间采样到错误的PWRITE电平。
解决:在APB主机中,PWRITE信号必须与PENABLE同源同步,即仅在PENABLE=1期间更新PWRITE值,其余时间保持上一拍状态。

4.3 现象:多主机系统中,CPU与DMA交替访问同一AHB从机时出现地址错位

原因:V2.0规范第3.11.5节要求“锁定传输(LOCKED)期间,仲裁器必须禁止其他主机请求”,但RTL中仲裁器未检测HMASTLOCK信号,或检测逻辑存在亚稳态。
解决:在仲裁器输入端,对HMASTLOCK使用两级触发器同步,并在状态机中增加LOCKED_ACTIVE标志,该标志仅在HMASTLOCK=1且HBUSREQ=1时置位,且必须等到当前传输HRESP=2'b00(OKAY)后才清除。

4.4 现象:ASB总线在复位退出后,首个传输总是失败

原因:V2.0规范第4.7.1节规定“退出复位时,所有ASB信号必须在ARSTN上升沿后满足tASB_RST(复位恢复时间)”,但文档未给出具体数值。实测发现tASB_RST需≥ 3个ASB_CLK周期,而RTL中仅等待1个周期。
解决:在ASB主机复位释放逻辑中,强制插入3周期计数器,确保ARSTN=1后,ASB_ADR/ASB_DAT等信号至少稳定3个时钟周期才发起首传。

4.5 现象:AHB-to-APB桥接模块在突发读场景下,APB侧PREADY延迟超标

原因:V2.0规范第3.15节允许“在宽总线上实现窄从机”,但桥接模块未按第3.15.1节要求“对HADDR进行截断后映射到APB_PADDR”,导致地址译码逻辑过深,PREADY路径延时超出APB时序预算。
解决:在桥接模块中,将HADDR[31:0]直接截取低12位作为PADDR[11:0](假设APB地址空间为4KB),绕过全宽度地址比较器,使PREADY路径减少2级逻辑门。


5. 协议验证实战:用UVM搭建AMBA AHB黄金参考模型

光看懂V2.0规范不够,必须用可执行的验证环境把它“钉死”在波形上。我在线上课程中反复强调:AMBA验证不是跑通几个testcase,而是构建一个能覆盖V2.0所有时序边界、响应语义、异常路径的黄金参考模型(Golden Reference Model)。下面以UVM为框架,展示如何从V2.0规范原文直接生成可仿真的验证组件。

5.1 基于V2.0第3.9节的HRESP状态机建模

V2.0规范第3.9节用文字描述了HRESP的四种状态(OKAY/RETRY/SPLIT/ERROR)及其触发条件,但未给出状态转移图。我们将其转化为UVM中的reference model:

class ahb_ref_model extends uvm_component; // 状态变量严格对应V2.0第3.9节定义 typedef enum {OKAY, RETRY, SPLIT, ERROR} hresp_t; hresp_t expected_hresp; virtual task run_phase(uvm_phase phase); forever begin @(posedge vif.HCLK); if (vif.HRESETn == 0) begin expected_hresp = OKAY; continue; end // 关键:按V2.0第3.9.2节,HRESP必须在HREADY为高后采样 if (vif.HREADY === 1'b1) begin case ({vif.HTRANS, vif.HSIZE}) {3'b010, 3'b001}: expected_hresp = OKAY; // NONSEQ + BYTE {3'b011, 3'b010}: expected_hresp = RETRY; // SEQ + HALFWORD,从机忙 {3'b100, 3'b011}: expected_hresp = SPLIT; // BUSY + WORD,从机需重试 default: expected_hresp = ERROR; // 其他非法组合 endcase end end endtask endclass

这段代码的每一行都锚定V2.0规范的具体条款:HTRANS和HSIZE的组合判断来自第3.5节“传输类型”,HREADY===1'b1的采样条件来自第3.9.1节,四种hresp_t枚举值直接引用第3.9节标题。它不是凭空写的“测试逻辑”,而是规范条款的机器可读翻译。

5.2 用V2.0时序参数表驱动验证约束

V2.0规范第3.18.3节、第3.19.3节、第3.20.3节分别给出了AHB从机、主机、仲裁器的时序参数表(tHADDR、tHDATA、tHREADY等)。这些数值不是摆设,而是验证平台的输入约束源:

参数名V2.0规范值UVM约束表达式用途
tHADDR≥ 2.5nsconstraint c_addr {vif.HADDR inside {[0:0xFFFFFFFF]};}确保地址信号在建立时间内稳定
tHREADY≥ 2nsconstraint c_ready {vif.HREADY dist {1'b1:=90, 1'b0:=10};}模拟从机响应延迟分布
tHRESP≤ 1.8ns`assert property (@(posedge vif.HCLK) vif.HREADY-> ##1 vif.HRESP !== 2'bxx);`

注意:UVM中dist约束和assert property的写法,直接将V2.0的“最小/最大时间”转化为“概率分布”和“时序断言”,这是把纸面规范变成可执行验证的最短路径。

5.3 异常路径覆盖:SPLIT重试与ERROR传播链

V2.0规范第3.9.5节要求“SPLIT响应后,主机必须在后续传输中重试原地址”,第3.9.4节要求“ERROR响应必须触发总线错误中断”。我们在UVM test中强制注入这些异常:

class ahb_error_test extends uvm_test; task run_phase(uvm_phase phase); // 步骤1:发起正常BURST传输 ahb_seq.start(sequencer); // 步骤2:在第2拍插入SPLIT响应(模拟V2.0第3.9.5节场景) config_db#(int)::set(null, "ref_model", "inject_split_at", 2); // 步骤3:等待重试完成(验证主机是否遵守V2.0第3.9.5节) wait (ref_model.retried_address == original_addr); // 步骤4:强制HRESP=2'b10(ERROR) config_db#(int)::set(null, "ref_model", "inject_error", 1); // 步骤5:检查中断信号是否在2个HCLK内拉高(V2.0第3.9.4节隐含要求) assert (vif.HINT === 1'b1) else `uvm_error("ERR", "HINT not asserted after ERROR"); endtask endclass

这个test的每一步都在验证V2.0的一个具体条款。它不关心你的DUT RTL怎么写,只关心它是否满足规范白纸黑字的要求——这才是AMBA验证的本质。


6. 工程化落地技巧:从V2.0规范到可交付IP核的3个关键动作

在某高校SoC课程设计中,学生团队用V2.0规范实现了AHB UART IP核,但流片后发现:在100MHz AHB时钟下,UART接收FIFO总是溢出。最后排查发现,问题不在UART逻辑,而在AHB接口层对V2.0第3.10.3节“端结构(Endianness)”的实现偏差。这件事让我彻底明白:把规范读懂只是起点,真正决定IP核能否量产的,是三个工程化动作——信号完整性预检、时序预算反推、异常注入覆盖率闭环。下面分享我在多个项目中沉淀下来的实操清单。

6.1 动作一:用V2.0信号列表做“物理层体检表”

V2.0规范第2章列出了AHB/ASB/APB全部信号及其方向、位宽、电气特性。这不是用来背的,而是要填成一张可执行的体检表。以AHB为例:

信号名方向位宽V2.0条款体检项实测方法合格标准
HADDRO322.2.1是否存在未连接悬空引脚综合报告+版图DRC所有bit必须连接,无NC
HWDATAO322.2.2驱动强度是否匹配目标工艺EDA工具IBIS仿真IO驱动电流≥2mA@3.3V
HREADYI12.2.3输入端是否加了同步触发器RTL代码审查必须两级FF同步
HRESPI22.2.4是否存在亚稳态风险时序分析报告Tmet<0.5ns

这张表的每一行都来自V2.0原文,但转化成了可测量、可审计的工程指标。比如“HREADY必须两级FF同步”,直接对应V2.0第3.18.2节时序图中HREADY到内部寄存器的采样路径。没有这张表,你的IP核在不同Foundry工艺下必然出现兼容性问题。

6.2 动作二:用V2.0时序参数反推“最坏情况路径”

V2.0规范给出的时序参数(如tHREADY≥2ns)是从机必须满足的保证值,但你的IP核作为从机,必须证明自己在最坏工艺角(FF/SS/TT)下仍能满足。方法是反向计算:

  • 步骤1:从V2.0第3.18.3节查出tHREADY_min = 2ns;
  • 步骤2:在EDA工具中设置时序约束:set_input_delay -max 2.0 -clock HCLK [get_ports HREADY];
  • 步骤3:运行STA(Static Timing Analysis),检查所有HREADY输入路径的slack是否≥0;
  • 步骤4:若slack为负,则必须在RTL中插入缓冲器或重布局,直到满足V2.0要求。

这个过程把V2.0的“纸面承诺”变成了“硅基证据”。我曾在一个项目中发现,某AHB从机在SS工艺角下tHREADY slack=-0.3ns,按V2.0规范它已不合格,但团队想“赌一把”流片。结果上板后在高温环境下HREADY偶尔失锁,导致DMA传输丢包——这就是没把V2.0参数当真吃的亏。

6.3 动作三:用V2.0异常场景构建“故障注入覆盖率”

V2.0规范第3.9节定义了ERROR/SPLIT/RETRY三种异常响应,但很多验证只覆盖“正常路径”。真正的工程化做法,是用这些异常构建故障注入测试集,并量化覆盖率:

异常类型V2.0条款注入方式覆盖率目标验证重点
HRESP=ERROR3.9.4在UVM sequencer中随机置HRESP=2'b10100%检查HINT中断、总线是否冻结、DMA是否重启
HRESP=SPLIT3.9.5在第2拍突发中注入SPLIT100%检查主机是否重试原地址、重试次数是否≤3
HREADY拉低5周期3.9.1强制HREADY=0持续5HCLK100%检查HADDR是否锁存、HTRANS是否保持BUSY

这个表格的覆盖率目标不是随便定的,而是来自V2.0规范的强制要求:第3.9.4节说“ERROR必须触发错误处理”,那就必须100%验证;第3.9.5节说“SPLIT后必须重试”,那就必须100%验证重试行为。我在某公司IP核交付流程中,把这项覆盖率纳入准入门槛——低于100%不准签核(sign-off)。

从那以后我每次做AMBA IP核,都强制走一遍这三步:先填信号体检表,再跑最坏时序反推,最后用V2.0异常条款打满故障注入覆盖率。它不能保证100%不出bug,但能确保每一个bug都暴露在流片前。希望帮到你。

本文还有配套的精品资源,点击获取

需要专业的网站建设服务?

联系我们获取免费的网站建设咨询和方案报价,让我们帮助您实现业务目标

立即咨询