☰
UART Lite:AXI总线入门的黄金切口与信号级实践指南
2026/10/14 12:53:02 网站建设 项目流程

1. 为什么UART Lite IP核是AXI总线入门的“黄金切口”

刚接触FPGA系统级设计的人,常被AXI总线的五通道、握手机制、地址对齐、突发传输这些术语绕得头晕。我带过不少某高校数字系统课程的学生,他们第一次看到AXI4-Lite协议文档时,第一反应不是“怎么用”,而是“这玩意儿到底在解决什么问题”。其实AXI不是凭空造出来的复杂规范,它是为了解决一个非常具体、非常现实的工程矛盾:如何让高速可编程逻辑(PL)和高性能处理器系统(PS)之间,既保持数据吞吐能力,又不把接口逻辑写成一团乱麻。

而UART Lite IP核,恰恰是Xilinx官方IP库里最轻量、最透明、最“不藏私”的AXI从设备之一。它没有DMA、不支持突发、不处理中断寄存器分组、连地址映射都只占4个32位寄存器——但正因如此,它成了AXI总线行为的“显微镜”。你用它,不是为了做高性能串口通信,而是为了看清AXI信号在真实硬件上是怎么一拍一拍走起来的。比如,当你在Vivado里生成一个UART Lite IP,并把它挂到Zynq的PS端AXI GP口上,再用SDK写一段XUartLite_Send(&UartLite, tx_data, 1),背后发生的是:CPU发出一次AXI写事务 → AXI总线拉高AWVALID/WDATA/WSTRB → UART Lite IP内部状态机采样地址0x00(TX_FIFO寄存器)→ 把数据锁存进FIFO → 同时拉高WREADY表示接收完成。整个过程没有缓存、没有重试、没有乱序,所有信号变化都能在ILA里抓到,毫秒级延迟都可预测。

这和用AXI DMA控制器或AXI Ethernet MAC IP完全不是一个学习路径。后者像开一辆带自动挡、ABS、ESP的SUV,你踩油门它就走,但底盘怎么调校、差速器怎么分配扭矩,全被封装了;而UART Lite就是一辆拆掉外壳的电动自行车——链条怎么咬合、飞轮怎么空转、刹车片怎么摩擦,全都裸露在外。所以我说,想真正理解AXI,别一上来就啃《AMBA AXI Protocol Specification》,先拿UART Lite跑通一个“写地址0x00=0x41,然后串口真打出A”这个闭环。这个闭环里,你亲手配置了AXI地址空间、亲手写了驱动里的寄存器偏移、亲手在逻辑分析仪上数了AWREADY和WVALID的时序关系。这种“肉眼可见的因果”,是任何仿真波形图都替代不了的实感。

提示:很多初学者卡在“明明代码写了Xil_Out32(BASEADDR + 0x00, 0x41),但串口没输出”,根本原因往往不是代码错,而是AXI地址映射没对上——UART Lite的寄存器基址在Vivado Block Design里默认是0x4060_0000,但你在SDK里定义的BASEADDR如果写成0x40600000(少了个下划线),编译器不会报错,硬件却永远收不到请求。这种细节,只有亲手搭一遍UART Lite才能刻进肌肉记忆。

2. UART Lite IP核的AXI接口信号解剖:从协议文档到物理引脚

AXI协议文档里动辄几十页的时序图,对新手来说就像天书。但UART Lite的AXI接口,只用了AXI4-Lite最精简的子集,总共就15根信号线(不含时钟复位),我们完全可以逐根“翻译”成工程师能听懂的大白话。这不是照搬手册,而是结合实际调试经验,告诉你每一根线在真实板子上“干了什么活”。

2.1 写地址通道(AW):告诉设备“我要往哪写”

  • awaddr[31:0]:32位地址总线。UART Lite只用了最低两位(因为只有4个寄存器),所以实际有效位是awaddr[1:0]。当awaddr[1:0] = 2'b00时,对应TX_FIFO(发送FIFO);2'b01对应RX_FIFO(接收FIFO);2'b10对应STATUS_REG(状态寄存器);2'b11对应CONTROL_REG(控制寄存器)。这里有个关键细节:Vivado自动生成的地址映射表里,UART Lite的基地址是0x4060_0000,那么写TX_FIFO的实际地址就是0x4060_0000 + 0x00 = 0x4060_0000。但如果你在SDK里用Xil_Out32(0x40600000, 0x41),而Vivado里该IP的地址范围被配置成0x4060_0000~0x4060_0FFF,那请求会直接被AXI Interconnect丢弃——因为地址没落在有效窗口内。所以地址对齐不是玄学,是物理连接的硬约束。

  • awvalid与awready:这是AXI的“握手”起点。CPU端(Master)把地址准备好后拉高awvalid,等待从设备(Slave,即UART Lite)拉高awready才认为地址被接受。实测中,UART Lite的awready几乎是即时响应的(1个周期延迟),因为它内部没有复杂的地址译码逻辑,就是一个简单的2位比较器。但如果你把UART Lite挂在一个带缓存的AXI Interconnect后面,awready可能会被延迟几个周期——这就是为什么初学者常看到ILA里awvalid和awready不同时拉高,误以为是IP坏了,其实是互连结构引入的流水线级数。

  • awprot[2:0]:保护类型信号,标示访问权限(如普通/特权、数据/指令、安全/非安全)。UART Lite作为纯数据外设,对这个信号完全忽略,内部逻辑直接接地。这意味着,即使你在SDK里用Xil_Out32()发起非特权访问,UART Lite照样收——它不认这套“身份认证”,这也是它“Lite”的体现。

2.2 写数据通道(W):把数据“塞”进设备

  • wdata[31:0]与wstrb[3:0]:32位数据总线+4位字节使能。UART Lite是32位AXI从设备,但它的TX_FIFO寄存器只用低8位(bit[7:0]),高位全为0。所以当你写Xil_Out32(BASEADDR, 0x00000041)时,wdata = 0x00000041,wstrb = 4'b0001(只使能最低字节)。这里有个易错点:如果误写Xil_Out32(BASEADDR, 0x41000000),wstrb还是0001,但wdata的0x41在最高字节,UART Lite会把0x00(低8位)写进TX_FIFO,结果串口输出空字符。所以wstrb不是摆设,它是硬件级的“数据定位器”。

  • wvalid与wready:数据有效信号和接收就绪信号。UART Lite的wready同样响应极快,但有一个隐藏条件:只有当TX_FIFO未满(STATUS_REG[2] = 0)时,wready才为高。如果FIFO已满,wready会拉低,CPU必须等待——这就是AXI的流控机制。我在某次调试中发现串口输出卡顿,抓波形发现wvalid一直高,但wready间歇性拉低,查STATUS_REG才发现软件没及时读取RX_FIFO,导致UART Lite内部状态机认为“忙”,连带影响TX路径。AXI的流控不是理论,是会实实在在卡住你的数据流的。

2.3 写响应通道(B):给CPU一个“收到”的回执

  • bresp[1:0]与bvalid/bready:写响应通道。UART Lite永远返回bresp = 2'b00(OKAY),表示写操作成功。bvalid在wready拉高后的下一个周期置高,bready由CPU端提供。这个通道的存在,是为了让CPU知道“我发的数据,对方确实收下了”,避免在总线异常(如从设备掉电)时CPU无限等待。虽然UART Lite几乎不会出错,但AXI协议强制要求这个响应环路,这是系统可靠性的底层契约。

2.4 读地址与读数据通道(AR/R):把设备里的数据“掏”出来

  • araddr[31:0]:读地址,逻辑同awaddr,只是指向RX_FIFO或STATUS_REG。
  • rdata[31:0]与rresp[1:0]:读数据和响应。读RX_FIFO时,rdata[7:0]返回接收到的字节;读STATUS_REG时,rdata[7:0]返回状态位(bit[0]=TX_FIFO空,bit[1]=RX_FIFO满,bit[2]=TX_FIFO满等)。rresp同样恒为OKAY。
  • rvalid与rready:读数据有效与接收就绪。UART Lite的rvalid在arready拉高后1周期置高,但rready由CPU控制——如果CPU不拉高rready,rvalid会一直保持,数据不会被采样。这解释了为什么有些驱动里要加while(!(Xil_In32(BASEADDR + 0x04) & 0x01));(等待RX_FIFO非空),而不是直接读——因为读操作本身需要rready配合,软件必须主动“取”,硬件才“给”。

注意:AXI协议规定,awvalid/wvalid/arvalid可以连续发出多个请求,形成“管道化”访问。但UART Lite作为Lite版本,内部没有请求队列,它只支持单拍(single-beat)访问。这意味着,如果你在SDK里连续执行两次Xil_Out32(),第二次的awvalid必须等到第一次的bvalid返回后才能发出。否则,AXI Interconnect会插入等待周期(Wait State),导致实际吞吐率远低于理论值。这个限制不是bug,是Lite IP的设计哲学:牺牲性能,换取确定性。

3. 从Block Design到SDK:手把手搭建AXI-UART Lite完整链路

光看信号不够,必须动手搭一个能跑起来的最小系统。下面以Zynq-7000系列(如Zybo Z7)为例,还原一个从Vivado创建工程、到SDK写驱动、再到串口输出“Hello AXI”的全流程。每一步都标注了新手最容易栽跟头的“地雷点”。

3.1 Vivado工程:Block Design里的三处关键配置

第一步,新建Vivado工程,选择目标器件,进入Create Block Design。核心操作就三步:

  1. 添加ZYNQ7 Processing System IP:双击配置,在Page 1的“PS-PL Configuration”里,确保“GP Master AXI Interface”下的S_AXI_GP0被勾选启用。这是PS端通往PL的“主干道”,没开它,后面所有AXI从设备都连不上。很多人做完设计后发现SDK里看不到AXI外设,90%是因为这一步漏了。

  2. 添加AXI UARTLITE IP:在IP Catalog里搜“uartlite”,拖入画布。双击配置,在“Configuration”页,把“Enable Interrupts”取消勾选(初学先关中断,避免复杂度爆炸);在“IO Ports”页,确认s_axi_aclk连到ZYNQ的FCLK_CLK0(通常100MHz),s_axi_aresetn连到ZYNQ的ARESETN。这里有个坑:s_axi_aresetn是低电平复位,而ZYNQ输出的ARESETN是高电平有效复位信号,Vivado会自动插入一个反相器,但如果你手动连错了,IP会一直处于复位态,所有寄存器读出来都是0。

  3. 地址分配与连线:右键ZYNQ IP,选“Run Block Automation”,勾选“Apply board preset”(自动适配开发板管脚)。然后右键空白处,“Validate Design”,此时Vivado会弹出地址分配窗口。找到UARTLITE_0,点击“Edit Address”,在Address Editor里,把Base Address设为0x40600000(十六进制),Range设为64K(0x10000)。这个64K不是随便写的——AXI Interconnect要求从设备地址范围必须是2的幂次,且不能小于4KB。设太小(如4KB),后续加其他IP可能地址冲突;设太大(如1MB),浪费地址空间。0x40600000是Xilinx官方例程常用地址,兼容性最好。

完成连线后,Generate Output Products → Create HDL Wrapper → Generate Bitstream。Bitstream生成成功,说明硬件层面的AXI连接已经物理打通。

3.2 SDK工程:驱动编写中的四个“魔鬼细节”

Bitstream下载到板子后,打开SDK,创建Application Project。关键不在代码多炫酷,而在四个决定成败的细节:

  1. BSP配置必须开启AXI支持:在SDK里右键你的BSP项目 → “Board Support Package Settings” → “Overview”页,勾选“ps7_uart_0”(这是PS端的UART,用于打印调试信息)和“axi_uartlite_0”(PL端的UART Lite)。更重要的是,在“Drivers”页,找到axi_uartlite驱动,点开其Advanced选项卡,把USE_AXI_LITE设为true。如果不设,SDK会默认用PS端UART驱动去操作PL端IP,必然失败。

  2. 头文件包含路径:在application.c开头,除了标准库,必须加:

    #include "xparameters.h" // 自动生成的硬件参数 #include "xuartlite.h" // UART Lite驱动API #include "xil_io.h" // AXI底层读写宏

    其中xparameters.h是Vivado导出硬件时自动生成的,里面定义了XPAR_AXI_UARTLITE_0_BASEADDR等宏。新手常犯的错误是直接写死0x40600000,一旦Vivado里改了地址,代码就失效。用宏才是工程化做法。

  3. 初始化与寄存器操作的时序陷阱:UART Lite上电后,TX_FIFO和RX_FIFO默认为空,但STATUS_REG的初始值不是全0。实测发现,刚上电时STATUS_REG[0](TX_FIFO空)为1,但STATUS_REG[2](TX_FIFO满)也为1——这是一个瞬态竞争状态。所以驱动里不能一上来就写TX_FIFO,必须先读STATUS_REG并等待TX_FIFO_EMPTY置位。正确写法:

    u32 status; do { status = Xil_In32(XPAR_AXI_UARTLITE_0_BASEADDR + 0x04); // 读STATUS_REG } while ((status & 0x01) == 0); // 等待bit0=1(空) Xil_Out32(XPAR_AXI_UARTLITE_0_BASEADDR + 0x00, 'H'); // 写TX_FIFO
  4. 波特率设置的硬件真相:UART Lite的波特率不是软件配置的,而是由S_AXI_ACLK时钟频率和IP核内部的分频系数决定的。在Vivado里双击UARTLITE IP,Configuration页的“Baud Rate”下拉菜单只是个提示,真正起作用的是C_BAUDRATE_DIV参数(在IP的.tcl配置文件里)。例如,S_AXI_ACLK=100MHz,要得到115200bps,分频系数=100000000 / (16 * 115200) ≈ 54.25,取整为54。所以波特率精度取决于时钟源和分频计算,软件里没有set_baudrate()函数——这是硬件定义的刚性约束。

3.3 硬件验证:用ILA抓取AXI信号的实战技巧

最后一步,也是最能建立“手感”的一步:用Vivado的Integrated Logic Analyzer(ILA)抓取真实信号。这比看仿真波形有用十倍。

  1. 触发点选择:在Block Design里,右键UARTLITE_0的s_axi_*信号线 → “Set as Debug”。重点勾选:s_axi_awvalid,s_axi_awaddr,s_axi_wvalid,s_axi_wdata,s_axi_wstrb,s_axi_bvalid,s_axi_arvalid,s_axi_rvalid,s_axi_rdata。不要全选,信号太多会撑爆ILA资源。

  2. 触发条件设置:在Vivado Hardware Manager里,加载.bit和.ltx文件后,打开ILA窗口。设置Trigger Setup:s_axi_awvalid == 1 && s_axi_awaddr == 0x40600000(写TX_FIFO的地址)。这样,一执行Xil_Out32(0x40600000, 'H'),ILA就精准捕获这一拍。

  3. 波形解读心法:抓到波形后,看三组关键时间关系:

    • awvalid拉高后,awready是否在1-2周期内响应?如果不是,检查AXI Interconnect配置。
    • wvalid拉高时,wstrb是否为0001?wdata[7:0]是否等于0x48('H'的ASCII)?
    • bvalid是否在wvalid&wready同为高后的下一周期拉高?如果延迟很长,说明AXI总线上有其他主设备在争抢带宽。

我曾用这个方法帮某公司工程师定位了一个诡异问题:串口输出随机乱码。抓波形发现wdata正确,但wstrb偶尔变成0010(使能第2字节),查代码发现是Xil_Out32()被误用为Xil_Out8(),导致32位写操作覆盖了相邻寄存器。ILA不撒谎,它把硬件的诚实刻在了每一个上升沿上。

4. AXI Lite与AXI Full的本质差异:为什么UART Lite不支持突发传输

很多初学者会困惑:既然AXI是“高级可扩展接口”,为什么UART Lite这么“简陋”,连最基本的突发(Burst)传输都不支持?这背后是Xilinx对IP核定位的深思熟虑,也揭示了AXI协议族的分层设计哲学。

4.1 协议层级的“职责分离”:Lite版是AXI的“最小可行接口”

AXI协议分为AXI3、AXI4、AXI4-Lite三个主要变体。它们的关系不是“升级版”,而是“场景特化版”。AXI4-Full是为高性能互联(如CPU与DDR控制器、GPU与视频编码器)设计的,它支持:

  • 突发传输(Burst):一次地址请求,连续传输1-256个数据拍,极大提升带宽利用率;
  • 乱序完成(Out-of-order completion):不同地址的读写请求可以交叉返回,隐藏内存延迟;
  • 独占访问(Exclusive access):用于实现原子操作,保障多核同步。

而AXI4-Lite,顾名思义,是AXI4的“轻量裁剪版”,它砍掉了所有为高性能优化的复杂机制,只保留最核心的读写能力。它的设计信条是:确定性优先于吞吐率,简单性优先于灵活性。UART Lite正是这一信条的完美载体。

为什么UART Lite不需要突发?因为串口本质是字节流设备。你发一个字符,UART硬件需要至少10个比特时间(1起始+8数据+1停止)才能送出,这期间总线是空闲的。如果强行用突发传16个字节,意味着CPU要一口气把16字节塞进TX_FIFO,但UART硬件只能以固定波特率慢慢吐,FIFO很快溢出。所以,UART Lite的“单拍写”不是缺陷,而是对串口物理特性的精准建模——它强迫软件按硬件节奏来,避免了缓冲区管理的复杂性。

4.2 寄存器映射的物理约束:4个32位寄存器的硬边界

翻开UART Lite的官方产品指南(PG142),它的寄存器映射表只有4行:

OffsetNameAccessDescription
0x00TX_FIFOWOWrite-only FIFO for transmit data
0x04RX_FIFORORead-only FIFO for receive data
0x08STATUS_REGRORead-only status register
0x0CCONTROL_REGWOWrite-only control register

注意,所有寄存器都是32位宽,但实际只用低8位(TX/RX_FIFO)或低4位(STATUS/CONTROL)。这个“4×32bit”的布局,是AXI Lite协议能支持的最小地址空间单元。AXI Lite要求每个从设备至少占用4KB(0x1000)地址空间,但UART Lite只用了最低的0x10字节(16字节),剩下的0xFF0字节全是保留的“空洞”。你可以向0x40600010写数据,UART Lite不会报错,但也不会有任何响应——它内部的地址译码器只认0x00/0x04/0x08/0x0C这四个偏移。

这个设计带来了两个关键优势:

  • 调试友好:所有寄存器都在同一页面(0x00~0x0F),用Xil_In32(BASEADDR + offset)就能全覆盖,不用记一堆分散地址。
  • 资源极致节省:UART Lite的RTL代码里,地址译码就是一句if (awaddr[1:0] == 2'b00) begin ... end else if (awaddr[1:0] == 2'b01) begin ... end,没有状态机、没有查找表、没有分支预测。综合后门电路(LUT)用量不足50个,是真正的“胶合逻辑”。

4.3 从Lite到Full的演进路径:何时该放弃UART Lite

当然,UART Lite不是万能的。当你的项目需求越过以下任一红线,就必须考虑更重的IP:

  • 需要DMA搬运大量数据:比如实时采集ADC数据流并存入DDR。这时应换用AXI DMA + AXI Stream FIFO + 自定义AXI Stream to UART IP,让DMA直接喂数据,CPU只管配置。
  • 需要精确时序控制:比如用UART模拟SPI或I2C时序。UART Lite的发送时序由内部波特率发生器锁定,无法微秒级干预,需用AXI GPIO + 状态机构建软UART。
  • 需要多主机仲裁:比如PS和PL里的另一个ARM核都要访问同一串口。AXI Lite不支持多主,必须上AXI Interconnect + AXI SmartConnect,甚至引入AXI Coherency Extensions(ACE)。

我参与过一个某图像处理Demo,初期用UART Lite打印调试信息,一切顺利;当加入实时JPEG压缩模块后,CPU频繁访问DDR,导致UART Lite的wready被AXI总线延迟,串口输出出现明显卡顿。解决方案不是优化UART Lite,而是把调试信息改用JTAG UART(PS端)输出,把PL端UART Lite专用于接收传感器指令——让每个AXI通道各司其职。这印证了一个经验:AXI不是越“重”越好,而是越“匹配”越好。Lite版的价值,正在于它用最轻的重量,扛起了最清晰的教育使命。

5. 常见故障排查链路:从“串口没输出”到“波形全绿”的完整诊断树

在真实项目中,AXI-UART Lite链路出问题,90%的情况不是IP坏了,而是某个环节的配置错位。下面是一套我总结的、可逐级执行的排查链路,每一步都有对应的验证方法和预期结果,帮你把“玄学问题”变成“确定性故障”。

5.1 第一层:硬件连接验证(5分钟)

目标:确认AXI总线物理连通,无地址/时钟/复位硬伤。

  • 检查点1:地址映射是否生效
    在SDK里,执行:

    xil_printf("Base Addr: 0x%08x\r\n", XPAR_AXI_UARTLITE_0_BASEADDR); xil_printf("Read 0x00: 0x%08x\r\n", Xil_In32(XPAR_AXI_UARTLITE_0_BASEADDR + 0x00)); xil_printf("Read 0x04: 0x%08x\r\n", Xil_In32(XPAR_AXI_UARTLITE_0_BASEADDR + 0x04));

    预期结果:Base Addr必须等于Vivado Address Editor里设置的值(如0x40600000);Read 0x00和Read 0x04应返回非0xFFFFFFFF的值(如0x00000000或0x00000001)。如果返回0xFFFFFFFF,说明AXI请求被AXI Interconnect丢弃,检查Vivado里UART Lite的地址范围是否在Interconnect的有效窗口内。

  • 检查点2:时钟与复位是否就绪
    用ILA抓uartlite_0/s_axi_aclk和s_axi_aresetn。预期:aclk有稳定方波(如100MHz);aresetn在FPGA配置完成后保持高电平。如果aresetn一直为低,检查ZYNQ IP的Reset Configuration是否正确,或尝试在Block Design里手动添加一个proc_sys_resetIP并连接。

5.2 第二层:协议行为验证(10分钟)

目标:确认AXI信号按协议规范交互,无握手失败。

  • 检查点3:写事务是否完成
    在SDK里执行一次写操作:

    Xil_Out32(XPAR_AXI_UARTLITE_0_BASEADDR + 0x00, 'X');

    同时用ILA抓awvalid,awready,wvalid,wready,bvalid,bready。预期波形序列:
    awvalid↑→awready↑(1拍后)→wvalid↑→wready↑(1拍后)→bvalid↑(1拍后)→bready↑(1拍后)。
    如果awready或wready迟迟不拉高,说明UART Lite未退出复位或内部状态机卡死,重启FPGA或检查aresetn信号。

  • 检查点4:读状态寄存器是否可信
    执行:

    u32 stat = Xil_In32(XPAR_AXI_UARTLITE_0_BASEADDR + 0x04); xil_printf("STATUS: 0x%08x\r\n", stat);

    预期:stat & 0x01(TX_FIFO空)应为1(刚上电时空);stat & 0x04(TX_FIFO满)应为0。如果stat恒为0,说明读事务失败,检查arvalid/rvalid波形;如果stat恒为0xFFFFFFFF,说明地址译码失败。

5.3 第三层:功能逻辑验证(15分钟)

目标:确认UART硬件行为符合预期,无FIFO或波特率异常。

  • 检查点5:TX_FIFO是否真的接收了数据
    连续写3个字符:

    Xil_Out32(BASEADDR+0x00, 'A'); Xil_Out32(BASEADDR+0x00, 'B'); Xil_Out32(BASEADDR+0x00, 'C');

    用逻辑分析仪(或另一台电脑的串口助手)监听UART Lite的tx引脚。预期:依次输出A、B、C,无乱码。如果只输出第一个字符,说明后续写操作被wready阻塞——检查STATUS_REG,确认TX_FIFO是否已满(stat & 0x04 == 1),如果是,说明波特率太低或未接终端,FIFO积压。

  • 检查点6:波特率是否准确
    用示波器测tx引脚的比特宽度。例如,115200bps下,1比特时间≈8.68μs。如果实测为10μs,则波特率≈100000bps,说明C_BAUDRATE_DIV计算错误。重新计算:DIV = round(CLK_FREQ / (16 * BAUD)),并在Vivado里重新配置UARTLITE IP。

5.4 第四层:系统级干扰排查(20分钟)

目标:排除PS端驱动、OS调度、总线争抢等隐性因素。

  • 检查点7:PS端UART是否抢占了AXI资源
    某些BSP配置中,PS端UART的驱动会周期性扫描所有AXI外设,产生背景流量。关闭PS UART的自动轮询:在BSP Settings →ps7_uart_0→Advanced→ENABLE_AUTO_POLLING设为false。

  • 检查点8:AXI Interconnect的QoS设置
    如果系统中有多个AXI主设备(如PS、DMA、自定义IP),在Vivado里双击AXI Interconnect IP → “Interconnect Configuration”,检查“Masters”页,确保S_AXI_GP0(PS)的QoS值高于其他主设备。否则,PS的AXI请求可能被低优先级主设备饿死。

这套排查链路,是我帮某实验室调试一个“串口时好时坏”问题时提炼的。最终发现是aresetn信号在FPGA配置完成后有约100ms的毛刺,导致UART Lite间歇性复位。用一个RC滤波电路(10kΩ+100nF)平滑后,问题彻底消失。AXI的世界里,没有“玄学”,只有未被发现的物理约束。

6. 超越UART Lite:AXI总线能力的延展实践建议

掌握了UART Lite这个“支点”,下一步就是撬动更广阔的AXI世界。这里分享几个经过验证的、低风险高回报的延展方向,每个都附带具体实施路径和避坑提示。

6.1 方向一:用AXI GPIO构建“可编程逻辑开关”

UART Lite教你读写寄存器,AXI GPIO则教你控制物理世界。它是最简单的AXI从设备,只有2个32位寄存器(DATA和TRI),但能直接驱动LED、按键、继电器。

  • 实施路径:在Vivado里添加AXI GPIO IP,配置为2-channel,Channel 1(Output)接4个LED,Channel 2(Input)接4个按键。地址设为0x40000000。SDK里用Xil_Out32(BASEADDR, 0xF)点亮所有LED。
  • 避坑提示:GPIO的TRI寄存器决定方向(0=输出,1=输入)。必须先写TRI=0x0(全输出),再写DATA,否则LED不亮。很多新手忘了这一步,以为IP坏了。

6.2 方向二:用AXI Timer实现“硬件级精准延时”

AXI Timer(AXI General Purpose Timer)提供纳秒级精度的计时器,比软件usleep()可靠百倍。

  • 实施路径:添加AXI Timer IP,勾选“Single Shot Mode”。在SDK里,写CONTROL_REG=0x1启动,读VALUE_REG获取剩余计数值。可用于精确控制PWM占空比或ADC采样间隔。
  • 避坑提示:Timer的时钟源必须与UART Lite一致(如FCLK_CLK0),否则时间基准错乱。在Vivado里务必检查s_axi_aclk连线。

6.3 方向三:用AXI BRAM Controller接入“片上高速存储”

AXI BRAM Controller把Block RAM变成AXI从设备,提供类似SRAM的读写体验。

  • 实施路径:添加AXI BRAM Controller + BRAM IP,配置BRAM深度为1024×32bit。地址设为0x40100000。SDK里用Xil_Out32(0x40100000, 0xDEADBEEF)写入,Xil_In32(0x40100000)读出,验证读写一致性。
  • 避坑提示:BRAM的EN(使能)信号必须由AXI BRAM Controller驱动,不能悬空。Vivado自动化连线会处理,但手动修改时易遗漏。

6.4 方向四:用AXI Stream协议桥接“高速数据流”

当你的需求从“控制”转向“数据搬运”,AXI Stream(AXI4-Stream)就是必经之路。它用TVALID/TREADY握手,无地址概念,专为视频、音频流设计。

  • 实施路径:用UART Lite的rx信号作为AXI Stream的tdata源,通过自定义IP将字节流打包成AXI Stream帧,再送入AXI DMA

需要专业的网站建设服务?

联系我们获取免费的网站建设咨询和方案报价,让我们帮助您实现业务目标

立即咨询